{"text_format":"1","workbook":"xlsx","n_sheets":13,"sheets":["Instructions","Design Sheet","Print 1","Recipe","Standard Recipe Sheet","Mould Sizes","Calculations 2","Batches","Fragrance","Oils","Colourants","Lye","Oils by Fatty Acids List"],"not_rendered":{"charts":2,"images":2,"macros":1,"external_links":0,"defined_names":1,"comments":0,"pivot_tables":0},"unopened":[],"bounds":{"document_bytes":16777216,"sheet_cells":100000,"rows_first":2000,"rows_last":500,"rows_between":2000,"halvings":0,"cell_chars":16384,"cell_head_chars":4096},"cells_cut":0,"cells_raw":0,"read":"whole","date_system":"1900"}

{"sheet":"Instructions","index":0,"n_rows":0,"n_cols":0,"rows_kept":0,"cut":false,"hidden":false,"merged":[]}

{"sheet":"Design Sheet","index":1,"n_rows":150,"n_cols":28,"rows_kept":150,"cut":false,"hidden":true,"merged":[[146,24,146,27],[147,24,147,27],[148,24,148,27],[149,24,149,27],[1,2,1,3],[1,6,1,12],[1,14,1,22],[1,24,1,27],[144,24,144,27],[145,24,145,27]]}
[null,"Fat/Oil"]
[null,"Apricot Kernel","Soaping Oils",null,null,null,"Expected Soap Characteristics",null,null,null,null,null,null,null,"Fatty Acid Composition",null,null,null,null,null,null,null,null,null,"Comparison Chart"]
[null,"Avocado","Oil Name","%",null,null,null,"Hardness","Cleansing","Conditioning","Bubbly","Creamy","Longevity",null,"Oil Name","Lauric","Myristic","Palmitic","Stearic","Ricinoleic","Oleic","Linoleic","Linolenic",null,null,"Lower Range","Actual Value","Upper Range"]
[null,"Avocado Butter","Olive",0.35,null,null,{"$f":"O4","v":"Olive"},{"$f":"SUM(P4:S4)","v":5.9499999999999993},{"$f":"SUM(P4:Q4)","v":0},{"$f":"SUM(T4:W4)","v":28.7},{"$f":"SUM(T4,P4:Q4)","v":0},{"$f":"SUM(R4:T4)","v":5.9499999999999993},{"$f":"R4+S4","v":5.9499999999999993},null,{"$f":"C4","v":"Olive"},{"$f":"IF(ISBLANK($C4),0,VLOOKUP($C4,'Oils by Fatty Acids List'!A:B,2))*$D4","v":0},{"$f":"IF(ISBLANK($C4),0,VLOOKUP($C4,'Oils by Fatty Acids List'!A:C,3))*$D4","v":0},{"$f":"IF(ISBLANK($C4),0,VLOOKUP($C4,'Oils by Fatty Acids List'!A:D,4))*$D4","v":4.8999999999999995},{"$f":"IF(ISBLANK($C4),0,VLOOKUP(C4,'Oils by Fatty Acids List'!A:E,5))*$D4","v":1.0499999999999998},{"$f":"IF(ISBLANK($C4),0,VLOOKUP(C4,'Oils by Fatty Acids List'!A:F,6))*$D4","v":0},{"$f":"IF(ISBLANK($C4),0,VLOOKUP(C4,'Oils by Fatty Acids List'!A:G,7))*$D4","v":24.15},{"$f":"IF(ISBLANK($C4),0,VLOOKUP($C4,'Oils by Fatty Acids List'!A:H,8)*$D4)","v":4.1999999999999993},{"$f":"IF(ISBLANK($C4),0,VLOOKUP($C4,'Oils by Fatty Acids List'!A:I,9))*$D4","v":0.35},null,"Max"]
[null,"Babassu, brazil nut","Coconut",0.2,null,null,"Coconut",15.800000000000002,13.400000000000002,2,13.400000000000002,2.4000000000000004,{"$f":"R5+S5","v":2.4000000000000004},null,"Coconut",{"$f":"IF(ISBLANK($C5),0,VLOOKUP($C5,'Oils by Fatty Acids List'!A:B,2))*$D5","v":9.6000000000000014},{"$f":"IF(ISBLANK($C5),0,VLOOKUP($C5,'Oils by Fatty Acids List'!A:C,3))*$D5","v":3.8000000000000003},{"$f":"IF(ISBLANK($C5),0,VLOOKUP($C5,'Oils by Fatty Acids List'!A:D,4))*$D5","v":1.8},{"$f":"IF(ISBLANK($C5),0,VLOOKUP(C5,'Oils by Fatty Acids List'!A:E,5))*$D5","v":0.60000000000000009},{"$f":"IF(ISBLANK($C5),0,VLOOKUP(C5,'Oils by Fatty Acids List'!A:F,6))*$D5","v":0},{"$f":"IF(ISBLANK($C5),0,VLOOKUP(C5,'Oils by Fatty Acids List'!A:G,7))*$D5","v":1.6},{"$f":"IF(ISBLANK($C5),0,VLOOKUP($C5,'Oils by Fatty Acids List'!A:H,8)*$D5)","v":0.4},{"$f":"IF(ISBLANK($C5),0,VLOOKUP($C5,'Oils by Fatty Acids List'!A:I,9))*$D5","v":0},null,"Hardness",29,{"$f":"H12","v":39},54]
[null,"Beeswax","Lard",0.25,null,null,"Lard",10.5,0.25,13,0.25,10.25,10.25,null,"Lard",{"$f":"IF(ISBLANK($C6),0,VLOOKUP($C6,'Oils by Fatty Acids List'!A:B,2))*$D6","v":0},{"$f":"IF(ISBLANK($C6),0,VLOOKUP($C6,'Oils by Fatty Acids List'!A:C,3))*$D6","v":0.25},{"$f":"IF(ISBLANK($C6),0,VLOOKUP($C6,'Oils by Fatty Acids List'!A:D,4))*$D6","v":7},{"$f":"IF(ISBLANK($C6),0,VLOOKUP(C6,'Oils by Fatty Acids List'!A:E,5))*$D6","v":3.25},{"$f":"IF(ISBLANK($C6),0,VLOOKUP(C6,'Oils by Fatty Acids List'!A:F,6))*$D6","v":0},{"$f":"IF(ISBLANK($C6),0,VLOOKUP(C6,'Oils by Fatty Acids List'!A:G,7))*$D6","v":11.5},{"$f":"IF(ISBLANK($C6),0,VLOOKUP($C6,'Oils by Fatty Acids List'!A:H,8)*$D6)","v":1.5},{"$f":"IF(ISBLANK($C6),0,VLOOKUP($C6,'Oils by Fatty Acids List'!A:I,9))*$D6","v":0},null,"Cleansing",12,{"$f":"I12","v":13.650000000000002},22]
[null,"Borage","Shea Butter",0.15,null,null,"Shea Butter",6.75,0,8.1,0,6.75,6.75,null,"Shea Butter",{"$f":"IF(ISBLANK($C7),0,VLOOKUP($C7,'Oils by Fatty Acids List'!A:B,2))*$D7","v":0},{"$f":"IF(ISBLANK($C7),0,VLOOKUP($C7,'Oils by Fatty Acids List'!A:C,3))*$D7","v":0},{"$f":"IF(ISBLANK($C7),0,VLOOKUP($C7,'Oils by Fatty Acids List'!A:D,4))*$D7","v":0.75},{"$f":"IF(ISBLANK($C7),0,VLOOKUP(C7,'Oils by Fatty Acids List'!A:E,5))*$D7","v":6},{"$f":"IF(ISBLANK($C7),0,VLOOKUP(C7,'Oils by Fatty Acids List'!A:F,6))*$D7","v":0},{"$f":"IF(ISBLANK($C7),0,VLOOKUP(C7,'Oils by Fatty Acids List'!A:G,7))*$D7","v":7.1999999999999993},{"$f":"IF(ISBLANK($C7),0,VLOOKUP($C7,'Oils by Fatty Acids List'!A:H,8)*$D7)","v":0.89999999999999991},{"$f":"IF(ISBLANK($C7),0,VLOOKUP($C7,'Oils by Fatty Acids List'!A:I,9))*$D7","v":0},null,"Conditioning",44,{"$f":"J12","v":56.7},69]
[null,"Brazil Nut","Castor",0.05,null,null,"Castor",0,0,4.9000000000000004,4.5,4.5,0,null,"Castor",{"$f":"IF(ISBLANK($C8),0,VLOOKUP($C8,'Oils by Fatty Acids List'!A:B,2))*$D8","v":0},{"$f":"IF(ISBLANK($C8),0,VLOOKUP($C8,'Oils by Fatty Acids List'!A:C,3))*$D8","v":0},{"$f":"IF(ISBLANK($C8),0,VLOOKUP($C8,'Oils by Fatty Acids List'!A:D,4))*$D8","v":0},{"$f":"IF(ISBLANK($C8),0,VLOOKUP(C8,'Oils by Fatty Acids List'!A:E,5))*$D8","v":0},{"$f":"IF(ISBLANK($C8),0,VLOOKUP(C8,'Oils by Fatty Acids List'!A:F,6))*$D8","v":4.5},{"$f":"IF(ISBLANK($C8),0,VLOOKUP(C8,'Oils by Fatty Acids List'!A:G,7))*$D8","v":0.2},{"$f":"IF(ISBLANK($C8),0,VLOOKUP($C8,'Oils by Fatty Acids List'!A:H,8)*$D8)","v":0.2},{"$f":"IF(ISBLANK($C8),0,VLOOKUP($C8,'Oils by Fatty Acids List'!A:I,9))*$D8","v":0},null,"Bubbly",14,{"$f":"K12","v":18.150000000000002},46]
[null,"Camellia",null,null,null,null,0,0,0,0,0,0,0,null,0,{"$f":"IF(ISBLANK($C9),0,VLOOKUP($C9,'Oils by Fatty Acids List'!A:B,2))*$D9","v":0},{"$f":"IF(ISBLANK($C9),0,VLOOKUP($C9,'Oils by Fatty Acids List'!A:C,3))*$D9","v":0},{"$f":"IF(ISBLANK($C9),0,VLOOKUP($C9,'Oils by Fatty Acids List'!A:D,4))*$D9","v":0},{"$f":"IF(ISBLANK($C9),0,VLOOKUP(C9,'Oils by Fatty Acids List'!A:E,5))*$D9","v":0},{"$f":"IF(ISBLANK($C9),0,VLOOKUP(C9,'Oils by Fatty Acids List'!A:F,6))*$D9","v":0},{"$f":"IF(ISBLANK($C9),0,VLOOKUP(C9,'Oils by Fatty Acids List'!A:G,7))*$D9","v":0},{"$f":"IF(ISBLANK($C9),0,VLOOKUP($C9,'Oils by Fatty Acids List'!A:H,8)*$D9)","v":0},{"$f":"IF(ISBLANK($C9),0,VLOOKUP($C9,'Oils by Fatty Acids List'!A:I,9))*$D9","v":0},null,"Creamy",16,{"$f":"L12","v":29.85},48]
[null,"Candelilla Wax",null,null,null,null,0,0,0,0,0,0,0,null,0,{"$f":"IF(ISBLANK($C10),0,VLOOKUP($C10,'Oils by Fatty Acids List'!A:B,2))*$D10","v":0},{"$f":"IF(ISBLANK($C10),0,VLOOKUP($C10,'Oils by Fatty Acids List'!A:C,3))*$D10","v":0},{"$f":"IF(ISBLANK($C10),0,VLOOKUP($C10,'Oils by Fatty Acids List'!A:D,4))*$D10","v":0},{"$f":"IF(ISBLANK($C10),0,VLOOKUP(C10,'Oils by Fatty Acids List'!A:E,5))*$D10","v":0},{"$f":"IF(ISBLANK($C10),0,VLOOKUP(C10,'Oils by Fatty Acids List'!A:F,6))*$D10","v":0},{"$f":"IF(ISBLANK($C10),0,VLOOKUP(C10,'Oils by Fatty Acids List'!A:G,7))*$D10","v":0},{"$f":"IF(ISBLANK($C10),0,VLOOKUP($C10,'Oils by Fatty Acids List'!A:H,8)*$D10)","v":0},{"$f":"IF(ISBLANK($C10),0,VLOOKUP($C10,'Oils by Fatty Acids List'!A:I,9))*$D10","v":0},null,"Longevity",25,{"$f":"M12","v":25.35},50]
{"$rows_left_out":141}
{"sheet":"Print 1","index":2,"n_rows":61,"n_cols":9,"rows_kept":61,"cut":false,"hidden":true,"merged":[[45,1,45,2],[13,1,13,4],[25,1,25,4],[36,1,36,4],[56,1,56,2],[47,1,47,4],[48,1,48,2],[42,1,42,2],[43,1,43,2],[44,1,44,2],[37,1,37,2],[38,1,38,2],[39,1,39,2],[40,1,40,2],[41,1,41,2],[48,5,56,9],[49,1,49,2],[50,1,50,2],[51,1,51,2],[52,1,52,2],[53,1,53,2],[54,1,54,2],[55,1,55,2],[11,2,11,4],[10,2,10,4],[5,2,5,4],[6,2,6,4],[7,2,7,4],[8,2,8,4],[9,2,9,4]]}
[]
[]
[null,null,null,null,null,null,{"$f":"TODAY()","v":"2023-09-27"},"Date ready",{"$f":"G3+30","v":"2023-10-27"}]
[]
[]
[null,"Container volume (ml)",{"$f":"Recipe!C6","v":1420},null,null,"Weight of Batch (g)",{"$f":"Recipe!C8","v":1388.7609600000001}]
[null,"Water:Lye Ratio",{"$f":"Recipe!C3","v":"2:1, Moderate Discount"},null,null,"Volume of Oils (ml)",{"$f":"Recipe!C9","v":1017}]
[null,"Superfat",{"$f":"Recipe!C4","v":0.04},null,null,"Weight of Water (g)",{"$f":"Recipe!C10","v":270}]
[null,"Number of Bars",{"$f":"Recipe!C7","v":9},null,null,"Weight of Lye (g)",{"$f":"Recipe!C12","v":142.76096000000001}]
[null,"Lye as % of Water",{"$f":"Recipe!C14","v":0.34586836894652057},null,null,"Weight of Oils (g)",{"$f":"Recipe!C11","v":936}]
{"$rows_left_out":52}
{"sheet":"Recipe","index":3,"n_rows":36,"n_cols":21,"rows_kept":36,"cut":false,"hidden":false,"merged":[[25,7,25,9],[19,4,19,5],[20,4,20,5],[21,4,21,5],[22,4,22,5],[23,4,23,5],[25,4,25,6],[18,4,18,5],[1,4,1,9],[14,4,14,9],[15,4,15,5],[16,4,16,5],[17,4,17,5]]}
[]
[null,"Mould Used","Small Silicone Loaf",null,"Oils"]
[null,"Water:Lye Ratio","2:1, Moderate Discount",null,"Name of Oil","%","Manual Oil Weights","Auto Oil Weights","Weight of Lye (NaOH)","Cost"]
[null,"Superfat",0.04,null,"Olive",0.35,null,{"$f":"IF(E4>0,IFERROR(IF($G$13>0,\"<= Use Manual Input\",'Calculations 2'!J10),0),0)","v":328},{"$f":"'Calculations 2'!K10","v":44},{"$f":"IFERROR(VLOOKUP(E4,Oils!A:G,7,FALSE)*'Calculations 2'!J10,0)","v":1.968}]
[null,"Mould Max Volume (ml)",{"$f":"IFERROR(VLOOKUP(C2,'Mould Sizes'!B:L,5,FALSE),0)","v":1456},null,"Coconut",0.2,null,{"$f":"IF(E5>0,IFERROR(IF($G$13>0,\"<= Use Manual Input\",'Calculations 2'!J11),0),0)","v":187},{"$f":"'Calculations 2'!K11","v":34},{"$f":"IFERROR(VLOOKUP(E5,Oils!A:G,7,FALSE)*'Calculations 2'!J11,0)","v":1.0846}]
[null,"Actual Volume Used in Mould",{"$f":"IFERROR(VLOOKUP(C2,'Mould Sizes'!B3:M33,11,FALSE),0)","v":1420},null,"Lard",0.25,null,{"$f":"IF(E6>0,IFERROR(IF($G$13>0,\"<= Use Manual Input\",'Calculations 2'!J12),0),0)","v":234},{"$f":"'Calculations 2'!K12","v":32},{"$f":"IFERROR(VLOOKUP(E6,Oils!A:G,7,FALSE)*'Calculations 2'!J12,0)","v":4.6706400000000006}]
[null,"Number of Bars",{"$f":"IFERROR(VLOOKUP(C2,'Mould Sizes'!B4:M21,12,FALSE),0)","v":9},null,"Shea Butter",0.15,null,{"$f":"IF(E7>0,IFERROR(IF($G$13>0,\"<= Use Manual Input\",'Calculations 2'!J13),0),0)","v":140},{"$f":"'Calculations 2'!K13","v":18},{"$f":"IFERROR(VLOOKUP(E7,Oils!A:G,7,FALSE)*'Calculations 2'!J13,0)","v":2.66}]
[null,"Weight of Batch",{"$f":"IFERROR(C11+C10+I13+I24+F35+I35,0)","v":1388.7609600000001},null,"Castor",0.05,null,{"$f":"IF(E8>0,IFERROR(IF($G$13>0,\"<= Use Manual Input\",'Calculations 2'!J14),0),0)","v":47},{"$f":"'Calculations 2'!K14","v":6},{"$f":"IFERROR(VLOOKUP(E8,Oils!A:G,7,FALSE)*'Calculations 2'!J14,0)","v":0.42770000000000002}]
[null,"Volume of Oils (ml)",{"$f":"IFERROR('Calculations 2'!I18,0)","v":1017},null,null,null,null,{"$f":"IF(E9>0,IFERROR(IF($G$13>0,\"<= Use Manual Input\",'Calculations 2'!J15),0),0)","v":0},{"$f":"'Calculations 2'!K15","v":0},{"$f":"IFERROR(VLOOKUP(E9,Oils!A:G,7,FALSE)*'Calculations 2'!J15,0)","v":0}]
[null,"Volume/Weight of Water (g)",{"$f":"IFERROR('Calculations 2'!L18,0)","v":270},null,null,null,null,{"$f":"IF(E10>0,IFERROR(IF($G$13>0,\"<= Use Manual Input\",'Calculations 2'!J16),0),0)","v":0},{"$f":"'Calculations 2'!K16","v":0},{"$f":"IFERROR(VLOOKUP(E10,Oils!A:G,7,FALSE)*'Calculations 2'!J16,0)","v":0}]
{"$rows_left_out":27}
{"sheet":"Standard Recipe Sheet","index":4,"n_rows":12,"n_cols":2,"rows_kept":12,"cut":false,"hidden":true,"merged":[]}
["Oil Name","% Used"]
["Olive",0.35]
["Coconut",0.2]
["Lard",0.25]
["Shea Butter",0.15]
["Castor",0.05]
[]
[]
[]
["Mould Used","Milk Carton"]
{"$rows_left_out":3}
{"sheet":"Mould Sizes","index":5,"n_rows":21,"n_cols":13,"rows_kept":21,"cut":false,"hidden":true,"merged":[[17,1,17,12],[1,1,1,12]]}
[]
[null,"RECTANGULAR MOULDS"]
[null,"Mould Name","Length (mm)","Width (mm)","Height (mm)","Max Volume (cubic mm)","Bar Thickness (mm)","Bar Width (mm)","Bar Height (mm)","Bar Volume (ml)","No. of Loaves","Used Volume (ml)","Number of Bars"]
[null,"Milk Carton",295,70,70,{"$f":"ROUND(IF('Mould Sizes'!$E4<>0,C4*D4*E4/1000,),0)","v":1446},29,70,70,{"$f":"ROUND(G4*H4*I4/1000,0)","v":142},{"$f":"IFERROR(ROUNDDOWN('Mould Sizes'!$D4/'Mould Sizes'!$H4,0),0)","v":1},{"$f":"ROUND('Mould Sizes'!$K4*'Mould Sizes'!$C4*'Mould Sizes'!$H4*'Mould Sizes'!$I4/1000,0)","v":1446},{"$f":"ROUNDDOWN(Table5[[#This Row],[Length (mm)]]/Table5[[#This Row],[Bar Thickness (mm)]]*K4,0)","v":10}]
[null,"Small Silicone Loaf",260,70,80,{"$f":"ROUND(IF('Mould Sizes'!$E5<>0,C5*D5*E5/1000,),0)","v":1456},28,70,78,153,{"$f":"IFERROR(ROUNDDOWN('Mould Sizes'!$D5/'Mould Sizes'!$H5,0),0)","v":1},{"$f":"ROUND('Mould Sizes'!$K5*'Mould Sizes'!$C5*'Mould Sizes'!$H5*'Mould Sizes'!$I5/1000,0)","v":1420},{"$f":"ROUNDDOWN(Table5[[#This Row],[Length (mm)]]/Table5[[#This Row],[Bar Thickness (mm)]]*K5,0)","v":9}]
[null,"Double Silicone Loaf",260,140,80,{"$f":"ROUND(IF('Mould Sizes'!$E6<>0,C6*D6*E6/1000,),0)","v":2912},28,70,79,155,{"$f":"IFERROR(ROUNDDOWN('Mould Sizes'!$D6/'Mould Sizes'!$H6,0),0)","v":2},{"$f":"ROUND('Mould Sizes'!$K6*'Mould Sizes'!$C6*'Mould Sizes'!$H6*'Mould Sizes'!$I6/1000,0)","v":2876},{"$f":"ROUNDDOWN(Table5[[#This Row],[Length (mm)]]/Table5[[#This Row],[Bar Thickness (mm)]]*K6,0)","v":18}]
[null,"Small Square",230,280,90,{"$f":"ROUND(IF('Mould Sizes'!$E7<>0,C7*D7*E7/1000,),0)","v":5796},25,70,89,156,{"$f":"IFERROR(ROUNDDOWN('Mould Sizes'!$D7/'Mould Sizes'!$H7,0),0)","v":4},{"$f":"ROUND('Mould Sizes'!$K7*'Mould Sizes'!$C7*'Mould Sizes'!$H7*'Mould Sizes'!$I7/1000,0)","v":5732},{"$f":"ROUNDDOWN(Table5[[#This Row],[Length (mm)]]/Table5[[#This Row],[Bar Thickness (mm)]]*K7,0)","v":36}]
[null,"Large Mould",465,480,85,{"$f":"ROUND(IF('Mould Sizes'!$E8<>0,C8*D8*E8/1000,),0)","v":18972},25,70,80,140,{"$f":"IFERROR(ROUNDDOWN('Mould Sizes'!$D8/'Mould Sizes'!$H8,0),0)","v":6},{"$f":"ROUND('Mould Sizes'!$K8*'Mould Sizes'!$C8*'Mould Sizes'!$H8*'Mould Sizes'!$I8/1000,0)","v":15624},{"$f":"ROUNDDOWN(Table5[[#This Row],[Length (mm)]]/Table5[[#This Row],[Bar Thickness (mm)]]*K8,0)","v":111}]
[null,"Commercial",800,600,80,{"$f":"ROUND(IF('Mould Sizes'!$E9<>0,C9*D9*E9/1000,),0)","v":38400},25,70,79,138,{"$f":"IFERROR(ROUNDDOWN('Mould Sizes'!$D9/'Mould Sizes'!$H9,0),0)","v":8},{"$f":"ROUND('Mould Sizes'!$K9*'Mould Sizes'!$C9*'Mould Sizes'!$H9*'Mould Sizes'!$I9/1000,0)","v":35392},{"$f":"ROUNDDOWN(Table5[[#This Row],[Length (mm)]]/Table5[[#This Row],[Bar Thickness (mm)]]*K9,0)","v":256}]
[]
{"$rows_left_out":12}
{"sheet":"Calculations 2","index":6,"n_rows":27,"n_cols":12,"rows_kept":27,"cut":false,"hidden":true,"merged":[]}
[]
[null,"Sample Batch Weight (g)",500]
[null,"Volume used in Mould",{"$f":"VLOOKUP(Recipe!C2,'Mould Sizes'!B4:M34,11,FALSE)","v":1420}]
[null,"Volume of Batch",{"$f":"F18+G18+H18","v":758.63212072373904}]
[null,"Ratio Batch to Mould",{"$f":"C3/C4","v":1.8717899772623818}]
[null,"Weight of Batch",{"$f":"J18+K18+L18","v":1340}]
[]
[]
[null,"Oil Name","%","SG","Weight of Oil","Oil Volume","Auto Lye","Auto Water","Scaled Oil Volume","Scaled Oil Weight","Scaled Lye Weight","Scaled Water Weight"]
[null,{"$f":"Recipe!E4","v":"Olive"},{"$f":"IFERROR(IF(B10<>\"\",VLOOKUP(B10,Recipe!$E4:$F4,2),0),0)","v":0.35},{"$f":"IFERROR(IF(ISBLANK(Recipe!E4),0,VLOOKUP(B10,Oils!A:D,4)),0)","v":0.91800000000000004},{"$f":"IF('Calculations 2'!$B10<>0,'Calculations 2'!$C10*$C$2,0)","v":175},{"$f":"IFERROR(E10/D10,0)","v":190.63180827886708},{"$f":"IF('Calculations 2'!$C10<>0,VLOOKUP(B10,Oils!A:B,2)*'Calculations 2'!E10,0)","v":23.450000000000003},{"$f":"VLOOKUP(Recipe!$C$3,'Calculations 2'!$B$23:$E$27,4,FALSE)*G10","v":46.900000000000006},{"$f":"ROUND('Calculations 2'!$F10*$C$5,0)","v":357},{"$f":"ROUND(IF('Calculations 2'!$B10<>0,'Calculations 2'!$E10*$C$5,0),0)","v":328},{"$f":"ROUND(IF('Calculations 2'!$B10<>0,'Calculations 2'!$G10*$C$5,0),0)","v":44},{"$f":"ROUND('Calculations 2'!$H10*$C$5,0)","v":88}]
{"$rows_left_out":18}
{"sheet":"Batches","index":7,"n_rows":10,"n_cols":12,"rows_kept":10,"cut":false,"hidden":true,"merged":[[0,1,0,11]]}
[null,"Batches"]
[null,"Made","No. of Bars","Fragrance","Batch OILS cost","FRAGRANCE COST","Sundries","Cost per bar","Markup","SELL Price","PROFIT","Date Ready"]
[null,"2023-06-13",11,"Blackberry Sage",9.34,7.5,null,{"$f":"IFERROR((E3+Table10[[#This Row],[FRAGRANCE COST]])/C3,0)","v":1.530909090909091},4,{"$f":"IFERROR(ROUNDUP((H3*I3),0),0)","v":7},{"$f":"(Table10[[#This Row],[SELL Price]]-Table10[[#This Row],[Cost per bar]])*Table10[[#This Row],[No. of Bars]]","v":60.16},{"$f":"IF(Table10[[#This Row],[Made]]>0,Table10[[#This Row],[Made]]+28,0)","v":"2023-07-11"}]
[null,"2023-08-05",14,"Mango",16.2425,3.5000000000000004,null,{"$f":"IFERROR((E4+Table10[[#This Row],[FRAGRANCE COST]])/C4,0)","v":1.4101785714285715},4,6,{"$f":"(Table10[[#This Row],[SELL Price]]-Table10[[#This Row],[Cost per bar]])*Table10[[#This Row],[No. of Bars]]","v":64.257500000000007},{"$f":"IF(Table10[[#This Row],[Made]]>0,Table10[[#This Row],[Made]]+28,0)","v":"2023-09-02"}]
[null,"2023-08-24",20,"Coconut",11.741300000000001,5.2347428571428578,0.92999999999999994,0.89530214285714282,3,3,{"$f":"(Table10[[#This Row],[SELL Price]]-Table10[[#This Row],[Cost per bar]])*Table10[[#This Row],[No. of Bars]]","v":42.093957142857136},{"$f":"IF(Table10[[#This Row],[Made]]>0,Table10[[#This Row],[Made]]+28,0)","v":"2023-09-21"}]
[null,"2023-08-24",10,"Christmas Kitchen",2.5067999999999997,3.2810000000000001,0.46499999999999997,0.62527999999999995,4,3,{"$f":"(Table10[[#This Row],[SELL Price]]-Table10[[#This Row],[Cost per bar]])*Table10[[#This Row],[No. of Bars]]","v":23.747199999999999},{"$f":"IF(Table10[[#This Row],[Made]]>0,Table10[[#This Row],[Made]]+28,0)","v":"2023-09-21"}]
[null,"2023-08-24",10,"Cedarwood",7.7423999999999991,3.1488,0.75,1.16412,4,5,{"$f":"(Table10[[#This Row],[SELL Price]]-Table10[[#This Row],[Cost per bar]])*Table10[[#This Row],[No. of Bars]]","v":38.358800000000002},{"$f":"IF(Table10[[#This Row],[Made]]>0,Table10[[#This Row],[Made]]+28,0)","v":"2023-09-21"}]
[null,"2023-09-26",9,"Christmas Kitchen",7.8459233333333334,3.1688000000000005,0.46639999999999998,1.2756803703703705,4,{"$f":"IFERROR(ROUNDUP((H8*I8),0),0)","v":6},{"$f":"(Table10[[#This Row],[SELL Price]]-Table10[[#This Row],[Cost per bar]])*Table10[[#This Row],[No. of Bars]]","v":42.518876666666671},{"$f":"IF(Table10[[#This Row],[Made]]>0,Table10[[#This Row],[Made]]+28,0)","v":"2023-10-24"}]
[null,"2023-09-27",9,"Patchouli EO",11.13776,0.96,0.64639999999999997,1.4160177777777778,4,{"$f":"IFERROR(ROUNDUP((H9*I9),0),0)","v":6},{"$f":"(Table10[[#This Row],[SELL Price]]-Table10[[#This Row],[Cost per bar]])*Table10[[#This Row],[No. of Bars]]","v":41.255839999999992},{"$f":"IF(Table10[[#This Row],[Made]]>0,Table10[[#This Row],[Made]]+28,0)","v":"2023-10-25"}]
[null,"2023-09-27",9,"Patchouli & Lavender EO",11.13776,6.36,0,1.9441955555555555,4,{"$f":"IFERROR(ROUNDUP((H10*I10),0),0)","v":8},{"$f":"(Table10[[#This Row],[SELL Price]]-Table10[[#This Row],[Cost per bar]])*Table10[[#This Row],[No. of Bars]]","v":54.50224},{"$f":"IF(Table10[[#This Row],[Made]]>0,Table10[[#This Row],[Made]]+28,0)","v":"2023-10-25"}]
{"$rows_left_out":1}
{"sheet":"Fragrance","index":8,"n_rows":25,"n_cols":8,"rows_kept":25,"cut":false,"hidden":true,"merged":[]}
["Fragrance Name","Type","Brand","Supplier","Package Size (ml)","Package Cost","Cost / unit","Rec. %"]
["Black Raspberry & Vanilla","Fragrance Oil","Luxaroma","Eroma",520,27.05,{"$f":"IF(E2>0,F2/E2,0)","v":5.2019230769230769E-2},0.05]
["Blackberry Sage","Fragrance Oil","Bramble Berry","Aussie Soap Supplies",100,18.75,{"$f":"IF(E3>0,F3/E3,0)","v":0.1875},0.05]
["Cedarwood","Essential Oil","Escentials ","Escentials ",500,41,{"$f":"IF(E4>0,F4/E4,0)","v":8.2000000000000003E-2},0.05]
["Christmas Cedar","Fragrance Oil","Luxaroma","Eroma",520,29.53,{"$f":"IF(E5>0,F5/E5,0)","v":5.6788461538461538E-2},0.05]
["Christmas Kitchen","Fragrance Oil","Escentials ","Escentials ",100,8.5,{"$f":"IF(E6>0,F6/E6,0)","v":8.5000000000000006E-2},0.05]
["Clary Sage","Essential Oil","Escentials ","Escentials ",100,35,{"$f":"IF(E7>0,F7/E7,0)","v":0.35},0.05]
["Coconut","Fragrance Oil","Luxaroma","Eroma",105,7.92,{"$f":"IF(E8>0,F8/E8,0)","v":7.5428571428571428E-2},0.05]
["Coffee (USA)","Fragrance Oil","Escentials ","Escentials ",100,8.5,{"$f":"IF(E9>0,F9/E9,0)","v":8.5000000000000006E-2},0.05]
["Country Kitchen","Fragrance Oil","Bramble Berry","Aussie Soap Supplies",100,16,{"$f":"IF(E10>0,F10/E10,0)","v":0.16},0.05]
{"$rows_left_out":16}
{"sheet":"Oils","index":9,"n_rows":100,"n_cols":7,"rows_kept":100,"cut":false,"hidden":true,"merged":[]}
["Fat/Oil","Sodium Hydroxide","Potassium Hydroxide","Specific","Package Price","Package Size","Cost / g"]
[null,"NaOH","KOH"," Gravity",null,"g or ml"]
["Apricot Kernel",0.13500000000000001,{"$f":"B3*(56.1/39.99)","v":0.18938484621155291},0.94,null,null,{"$f":"IFERROR(IF(ISBLANK(E3),,E3/F3),0)","v":0}]
["Avocado",0.13300000000000001,0.18657914478619655,0.91500000000000004,null,null,{"$f":"IFERROR(IF(ISBLANK(E4),,E4/F4),0)","v":0}]
["Avocado Butter",0.13389999999999999,0.18784171042760689,0.90400000000000003,null,null,0]
["Babassu, brazil nut",0.17599999999999999,0.24690172543135783,0.89700000000000002,null,null,0]
["Beeswax",6.9000000000000006E-2,9.6796699174793707E-2,0.96585059576708199,null,null,0]
["Borage",0.13569999999999999,0.19036684171042759,0.92269999999999996,null,null,0]
["Brazil Nut",0.17499999999999999,0.24549887471867965,0.89700000000000002,null,null,0]
["Camellia",0.13619999999999999,0.19106826706676666,0.91500000000000004,null,null,0]
{"$rows_left_out":91}
{"sheet":"Colourants","index":10,"n_rows":15,"n_cols":7,"rows_kept":15,"cut":false,"hidden":true,"merged":[]}
["Colours","Type","Brand","Supplier","Package Weight (g)","Package Cost","Cost / g"]
["Blue Oxide","Oxide","Aussie Soap Supplies","Aussie Soap Supplies",40,8,{"$f":"IF(ISBLANK(A2),,F2/E2)","v":0.2}]
["Fizzy Lemonade","Neon","Aussie Soap Supplies","Aussie Soap Supplies",20,7.5,0.375]
["Fuchsia","Neon","Aussie Soap Supplies","Aussie Soap Supplies",20,7.5,0.375]
["UltraViolet Blue","Neon","Aussie Soap Supplies","Aussie Soap Supplies",20,7.5,0.375]
["Tangerine Wow","Neon","Aussie Soap Supplies","Aussie Soap Supplies",20,7.5,0.375]
["Green Oxide","Oxide","Aussie Soap Supplies","Aussie Soap Supplies",40,8,0.2]
["Titanium Dioxide","Oxide","Escentials","Escentials",100,9,0.09]
["Liquid Dye Soap - Red","Water Soluble","Eroma","Eroma",25,5.83,0.23319999999999999]
["Liquid Dye Soap - Yellow","Water Soluble","Eroma","Eroma",25,5.83,0.23319999999999999]
{"$rows_left_out":6}
{"sheet":"Lye","index":11,"n_rows":3,"n_cols":4,"rows_kept":3,"cut":false,"hidden":true,"merged":[]}
["Lye","Package Size","Package Cost","Cost / unit"]
["Sodium Hydroxide",5000,35.200000000000003,{"$f":"IFERROR(C2/B2,0)","v":7.0400000000000003E-3}]
["Potassium Hydroxide",500,25.85,5.1700000000000003E-2]

{"sheet":"Oils by Fatty Acids List","index":12,"n_rows":193,"n_cols":15,"rows_kept":193,"cut":false,"hidden":true,"merged":[]}
["Oil Name","Lauric","Myristic","Palmitic","Stearic","Ricinoleic","Oleic","Linoleic","Linolenic"]
["Sweet Almond",0,0,7,0,0,71,18,0]
["Apricot Kernel",0,0,6,0,0,66,27,0]
["Avocado",0,0,20,2,0,58,12,0]
["Avocado Butter",0,0,21,10,0,53,6,2]
["Babassu, brazil nut",50,20,11,4,0,10,0,0]
["Beeswax",0,0,0,0,0,0,0,0]
["Borage",0,0,10,4,0,20,43,5]
["Brazil Nut",0,0,13,11,0,39,36,0]
["Camelina",0,0,6,2,0,24,19,45]
{"$rows_left_out":183}